{"text_format":"1","workbook":"xlsx","n_sheets":11,"sheets":["ReadMe","Base Values","HVI & Yield Entry","Premiums & Discounts","Yield & Return","Mic","Str","Staple Lookup","G&S","Uni","Ext"],"not_rendered":{"charts":0,"images":1,"macros":1,"external_links":1,"defined_names":2,"comments":0,"pivot_tables":0},"unopened":[],"bounds":{"document_bytes":16777216,"sheet_cells":100000,"rows_first":2000,"rows_last":500,"rows_between":2000,"halvings":0,"cell_chars":16384,"cell_head_chars":4096},"cells_cut":0,"cells_raw":0,"read":"whole","date_system":"1900"}

{"sheet":"ReadMe","index":0,"n_rows":35,"n_cols":1,"rows_kept":35,"cut":false,"hidden":false,"merged":[]}
[]
[]
[]
["Two data entry sheets (Base Values and HVI & Yield Entry)"]
["Two output sheets (Premiums & Discounts and Yield & Return)"]
[]
["Step 1 - Base Values sheet"]
["Check/enter cells of base data for the loan value, seed value, costs, and turnout."]
["These values are applied to Yield & Return calculations."]
[]
["Step 2 - HVI & Yield Entry sheet"]
["HVI Option 1 - Import"]
["The Loan Calculator can import data from sources with known formatting (i.e., USDA, Texas Tech FBRI, and Cotton Incorporated).  After importing, the HVI data are automatically fed into the Premiums & Discounts sheet."]
["If the import option is not working for one of the known formats, please email us (address below) so we can de-bug it for you."]
["HVI Option 2 - Paste HVI data"]
{"$rows_left_out":21}
{"sheet":"Base Values","index":1,"n_rows":14,"n_cols":3,"rows_kept":14,"cut":false,"hidden":false,"merged":[]}
["Enter Base Values"]
[]
[null,"Base Values","Value Units"]
["Study/Test Title","2024/25 Sample Loan Values","n/a"]
[]
["Base Quality Price (41 Color, 4 Leaf, 34 Staple)",52,"cents/lb"]
[]
["Cottonseed Value (USD/ton)",185,"USD/ton"]
[]
["Picking/Stripping & Moduling Cost per Cwt of Seed Cotton",3.2,"USD/Cwt"]
[]
["Ginning Cost per Pound of Lint",0.12,"USD/lb"]
[]
["Pounds of Seed per Pound of Lint",1.4119999999999999,"lb of seed per lb of lint"]

{"sheet":"HVI & Yield Entry","index":2,"n_rows":34,"n_cols":15,"rows_kept":34,"cut":false,"hidden":false,"merged":[[4,9,4,12]]}
["Enter HVI Data"]
["HVI data can either be imported or pasted"]
[]
["Import HVI Data"]
["HVI data from sources/labs with known formatting can be",null,null,null,null,null,null,null,null,"Extraneous Matter (blanks treated as 0)"]
["imported with the buttons below.  After you locate the file, the",null,null,null,null,null,null,null,null,"Bark",null,null,null,"Lint Yield","Turnout"]
["data will appear here and on the Premiums & Discount sheet.",null,"Sample Name/Code","Color","Leaf","Mic","Length","Strength","Uniformity","TX/NM/OK/KS","Prep","Other","Plastic","(lbs acre)","(%)"]
[]
[]
[]
[]
[]
[]
[]
[]
{"$rows_left_out":20}
{"sheet":"Premiums & Discounts","index":3,"n_rows":49,"n_cols":34,"rows_kept":49,"cut":false,"hidden":false,"merged":[[4,7,4,10],[4,13,4,17],[5,22,5,25]]}
["Premiums & Discounts"]
["Uses HVI data from HVI & Yield Entry sheet"]
[]
[]
[null,null,null,null,null,null,null,"Extraneous Matter (blanks treated as 0)",null,null,null,null,null,"Premiums & Discounts",null,null,null,null,null,"Net ","Loan",null,"These columns break out the discount for extraneous matter by type",null,null,null,null,null,null,null,null,null,"Mic Premium Eligibility"]
[null,null,null,null,null,null,null,"Bark",null,null,null,null,null,"Grade & ",null,null,"Ext",null,null,"Premium","Value",null,"Extraneous Matter Breakout",null,null,null,null,null,null,null,null,null,"Micronaire only eligible for certain windows of color/leaf"]
["Sample Name/Code","Color","Leaf","Mic","Length","Strength","Uniformity","TX/NM/OK/KS","Prep","Other","Plastic","Staple",null,"Length","Strength","Mic","Matter","Uniformity",null,"(points)","(cents/lb)",null,"TX/NM/OK/KS","Prep","Other","Plastic",null,"38+","26-31","n/a","Normal",null,"a/ Premium applies only to white grades 11-41, leaf 1-6; 51, leaf 1-5; light spotted grades 12-32, leaf 1-5; 42, leaf 1-4; and 52, leaf 1-3.","Raw Mic PD"]
[null,null,null,null,null,null,null,null,null,null,null,{"$f":"IF(LEN(A8)=0,\"\",IF(LEN(E8)=0,\"HVI data needed\",INDEX('Staple Lookup'!$C$3:$C$100,MATCH(TRUE,'Staple Lookup'!$B$3:$B$100>=ROUND(E8,2),0))))","v":""},null,{"$f":"IF(OR(LEN(B8)=0,LEN(C8)=0,LEN(D8)=0),\"\",IF(AND(RIGHT(B8,1)*1=1,C8=8),-2000,IF(L8>=38,AB8,IF(L8<=31,AC8,AE8))))","v":""},{"$f":"IF(LEN(A8)=0,\"\",INDEX(Str!$C$1:$C$20,MATCH(ROUND(F8,1),Str!$A$1:$A$20,1)))","v":""},{"$f":"IF(LEN(A8)=0,\"\",IF(AND(AG8=1,AH8>0),AH8,IF(AND(AG8=0,AH8>0),0,AH8)))","v":""},{"$f":"IF(LEN(A8)=0,\"\",SUM(W8:Z8))","v":""},{"$f":"IF(LEN(A8)=0,\"\",INDEX(Uni!$C$1:$C$20,MATCH(ROUND($G8,1),Uni!$A$1:$A$20,1)))","v":""},null,{"$f":"IF(LEN(A8)=0,\"\",IF(OR(LEN(B8)=0,LEN(C8)=0,LEN(D8)=0,LEN(E8)=0,LEN(F8)=0,LEN(G8)=0),\"no HVI data\",SUM(N8:R8)))","v":""},{"$f":"IF(LEN(A8)=0,\"\",IF(OR(LEN(B8)=0,LEN(C8)=0,LEN(D8)=0,LEN(E8)=0,LEN(F8)=0,LEN(G8)=0),\"no HVI data\",IF('Base Values'!$B$6+(SUM($N8:$R8)/100)<0,0,'Base Values'!$B$6+(SUM(N8:R8)/100))))","v":""},null,{"$f":"IF(LEN(A8)=0,\"\",IF(LEN(H8)=0,INDEX(Ext!$A$1:$G$5,MATCH(0,Ext!$A$1:$A$5,0),MATCH(H$7,Ext!$A$2:$E$2,0)),IF(AND(H8>=0,H8<3),INDEX(Ext!$A$1:$G$5,MATCH(H8,Ext!$A$1:$A$5,0),MATCH(H$7,Ext!$A$2:$E$2,0)),\"invalid entry\")))","v":""},{"$f":"IF(LEN(B8)=0,\"\",IF(LEN(I8)=0,INDEX(Ext!$A$1:$G$5,MATCH(0,Ext!$A$1:$A$5,0),MATCH(I$7,Ext!$A$2:$E$2,0)),IF(AND(I8>=0,I8<3),INDEX(Ext!$A$1:$G$5,MATCH(I8,Ext!$A$1:$A$5,0),MATCH(I$7,Ext!$A$2:$E$2,0)),\"invalid entry\")))","v":""},{"$f":"IF(LEN(C8)=0,\"\",IF(LEN(J8)=0,INDEX(Ext!$A$1:$G$5,MATCH(0,Ext!$A$1:$A$5,0),MATCH(J$7,Ext!$A$2:$E$2,0)),IF(AND(J8>=0,J8<3),INDEX(Ext!$A$1:$G$5,MATCH(J8,Ext!$A$1:$A$5,0),MATCH(J$7,Ext!$A$2:$E$2,0)),\"invalid entry\")))","v":""}]
[null,null,null,null,null,null,null,null,null,null,null,{"$f":"IF(LEN(A9)=0,\"\",IF(LEN(E9)=0,\"HVI data needed\",INDEX('Staple Lookup'!$C$3:$C$100,MATCH(TRUE,'Staple Lookup'!$B$3:$B$100>=ROUND(E9,2),0))))","v":""},null,{"$f":"IF(OR(LEN(B9)=0,LEN(C9)=0,LEN(D9)=0),\"\",IF(AND(RIGHT(B9,1)*1=1,C9=8),-2000,IF(L9>=38,AB9,IF(L9<=31,AC9,AE9))))","v":""},{"$f":"IF(LEN(A9)=0,\"\",INDEX(Str!$C$1:$C$20,MATCH(ROUND(F9,1),Str!$A$1:$A$20,1)))","v":""},{"$f":"IF(LEN(A9)=0,\"\",IF(AND(AG9=1,AH9>0),AH9,IF(AND(AG9=0,AH9>0),0,AH9)))","v":""},{"$f":"IF(LEN(A9)=0,\"\",SUM(W9:Z9))","v":""},{"$f":"IF(LEN(A9)=0,\"\",INDEX(Uni!$C$1:$C$20,MATCH(ROUND($G9,1),Uni!$A$1:$A$20,1)))","v":""},null,{"$f":"IF(LEN(A9)=0,\"\",IF(OR(LEN(B9)=0,LEN(C9)=0,LEN(D9)=0,LEN(E9)=0,LEN(F9)=0,LEN(G9)=0),\"no HVI data\",SUM(N9:R9)))","v":""},{"$f":"IF(LEN(A9)=0,\"\",IF(OR(LEN(B9)=0,LEN(C9)=0,LEN(D9)=0,LEN(E9)=0,LEN(F9)=0,LEN(G9)=0),\"no HVI data\",IF('Base Values'!$B$6+(SUM($N9:$R9)/100)<0,0,'Base Values'!$B$6+(SUM(N9:R9)/100))))","v":""},null,{"$f":"IF(LEN(A9)=0,\"\",IF(LEN(H9)=0,INDEX(Ext!$A$1:$G$5,MATCH(0,Ext!$A$1:$A$5,0),MATCH(H$7,Ext!$A$2:$E$2,0)),IF(AND(H9>=0,H9<3),INDEX(Ext!$A$1:$G$5,MATCH(H9,Ext!$A$1:$A$5,0),MATCH(H$7,Ext!$A$2:$E$2,0)),\"invalid entry\")))","v":""},{"$f":"IF(LEN(B9)=0,\"\",IF(LEN(I9)=0,INDEX(Ext!$A$1:$G$5,MATCH(0,Ext!$A$1:$A$5,0),MATCH(I$7,Ext!$A$2:$E$2,0)),IF(AND(I9>=0,I9<3),INDEX(Ext!$A$1:$G$5,MATCH(I9,Ext!$A$1:$A$5,0),MATCH(I$7,Ext!$A$2:$E$2,0)),\"invalid entry\")))","v":""},{"$f":"IF(LEN(C9)=0,\"\",IF(LEN(J9)=0,INDEX(Ext!$A$1:$G$5,MATCH(0,Ext!$A$1:$A$5,0),MATCH(J$7,Ext!$A$2:$E$2,0)),IF(AND(J9>=0,J9<3),INDEX(Ext!$A$1:$G$5,MATCH(J9,Ext!$A$1:$A$5,0),MATCH(J$7,Ext!$A$2:$E$2,0)),\"invalid entry\")))","v":""}]
[null,null,null,null,null,null,null,null,null,null,null,{"$f":"IF(LEN(A10)=0,\"\",IF(LEN(E10)=0,\"HVI data needed\",INDEX('Staple Lookup'!$C$3:$C$100,MATCH(TRUE,'Staple Lookup'!$B$3:$B$100>=ROUND(E10,2),0))))","v":""},null,{"$f":"IF(OR(LEN(B10)=0,LEN(C10)=0,LEN(D10)=0),\"\",IF(AND(RIGHT(B10,1)*1=1,C10=8),-2000,IF(L10>=38,AB10,IF(L10<=31,AC10,AE10))))","v":""},{"$f":"IF(LEN(A10)=0,\"\",INDEX(Str!$C$1:$C$20,MATCH(ROUND(F10,1),Str!$A$1:$A$20,1)))","v":""},"","",{"$f":"IF(LEN(A10)=0,\"\",INDEX(Uni!$C$1:$C$20,MATCH(ROUND($G10,1),Uni!$A$1:$A$20,1)))","v":""},null,"",{"$f":"IF(LEN(A10)=0,\"\",IF(OR(LEN(B10)=0,LEN(C10)=0,LEN(D10)=0,LEN(E10)=0,LEN(F10)=0,LEN(G10)=0),\"no HVI data\",IF('Base Values'!$B$6+(SUM($N10:$R10)/100)<0,0,'Base Values'!$B$6+(SUM(N10:R10)/100))))","v":""},null,{"$f":"IF(LEN(A10)=0,\"\",IF(LEN(H10)=0,INDEX(Ext!$A$1:$G$5,MATCH(0,Ext!$A$1:$A$5,0),MATCH(H$7,Ext!$A$2:$E$2,0)),IF(AND(H10>=0,H10<3),INDEX(Ext!$A$1:$G$5,MATCH(H10,Ext!$A$1:$A$5,0),MATCH(H$7,Ext!$A$2:$E$2,0)),\"invalid entry\")))","v":""},{"$f":"IF(LEN(B10)=0,\"\",IF(LEN(I10)=0,INDEX(Ext!$A$1:$G$5,MATCH(0,Ext!$A$1:$A$5,0),MATCH(I$7,Ext!$A$2:$E$2,0)),IF(AND(I10>=0,I10<3),INDEX(Ext!$A$1:$G$5,MATCH(I10,Ext!$A$1:$A$5,0),MATCH(I$7,Ext!$A$2:$E$2,0)),\"invalid entry\")))","v":""},{"$f":"IF(LEN(C10)=0,\"\",IF(LEN(J10)=0,INDEX(Ext!$A$1:$G$5,MATCH(0,Ext!$A$1:$A$5,0),MATCH(J$7,Ext!$A$2:$E$2,0)),IF(AND(J10>=0,J10<3),INDEX(Ext!$A$1:$G$5,MATCH(J10,Ext!$A$1:$A$5,0),MATCH(J$7,Ext!$A$2:$E$2,0)),\"invalid entry\")))","v":""}]
[null,null,null,null,null,null,null,null,null,null,null,{"$f":"IF(LEN(A11)=0,\"\",IF(LEN(E11)=0,\"HVI data needed\",INDEX('Staple Lookup'!$C$3:$C$100,MATCH(TRUE,'Staple Lookup'!$B$3:$B$100>=ROUND(E11,2),0))))","v":""},null,{"$f":"IF(OR(LEN(B11)=0,LEN(C11)=0,LEN(D11)=0),\"\",IF(AND(RIGHT(B11,1)*1=1,C11=8),-2000,IF(L11>=38,AB11,IF(L11<=31,AC11,AE11))))","v":""},{"$f":"IF(LEN(A11)=0,\"\",INDEX(Str!$C$1:$C$20,MATCH(ROUND(F11,1),Str!$A$1:$A$20,1)))","v":""},"","",{"$f":"IF(LEN(A11)=0,\"\",INDEX(Uni!$C$1:$C$20,MATCH(ROUND($G11,1),Uni!$A$1:$A$20,1)))","v":""},null,"",{"$f":"IF(LEN(A11)=0,\"\",IF(OR(LEN(B11)=0,LEN(C11)=0,LEN(D11)=0,LEN(E11)=0,LEN(F11)=0,LEN(G11)=0),\"no HVI data\",IF('Base Values'!$B$6+(SUM($N11:$R11)/100)<0,0,'Base Values'!$B$6+(SUM(N11:R11)/100))))","v":""},null,{"$f":"IF(LEN(A11)=0,\"\",IF(LEN(H11)=0,INDEX(Ext!$A$1:$G$5,MATCH(0,Ext!$A$1:$A$5,0),MATCH(H$7,Ext!$A$2:$E$2,0)),IF(AND(H11>=0,H11<3),INDEX(Ext!$A$1:$G$5,MATCH(H11,Ext!$A$1:$A$5,0),MATCH(H$7,Ext!$A$2:$E$2,0)),\"invalid entry\")))","v":""},{"$f":"IF(LEN(B11)=0,\"\",IF(LEN(I11)=0,INDEX(Ext!$A$1:$G$5,MATCH(0,Ext!$A$1:$A$5,0),MATCH(I$7,Ext!$A$2:$E$2,0)),IF(AND(I11>=0,I11<3),INDEX(Ext!$A$1:$G$5,MATCH(I11,Ext!$A$1:$A$5,0),MATCH(I$7,Ext!$A$2:$E$2,0)),\"invalid entry\")))","v":""},{"$f":"IF(LEN(C11)=0,\"\",IF(LEN(J11)=0,INDEX(Ext!$A$1:$G$5,MATCH(0,Ext!$A$1:$A$5,0),MATCH(J$7,Ext!$A$2:$E$2,0)),IF(AND(J11>=0,J11<3),INDEX(Ext!$A$1:$G$5,MATCH(J11,Ext!$A$1:$A$5,0),MATCH(J$7,Ext!$A$2:$E$2,0)),\"invalid entry\")))","v":""}]
[null,null,null,null,null,null,null,null,null,null,null,{"$f":"IF(LEN(A12)=0,\"\",IF(LEN(E12)=0,\"HVI data needed\",INDEX('Staple Lookup'!$C$3:$C$100,MATCH(TRUE,'Staple Lookup'!$B$3:$B$100>=ROUND(E12,2),0))))","v":""},null,{"$f":"IF(OR(LEN(B12)=0,LEN(C12)=0,LEN(D12)=0),\"\",IF(AND(RIGHT(B12,1)*1=1,C12=8),-2000,IF(L12>=38,AB12,IF(L12<=31,AC12,AE12))))","v":""},{"$f":"IF(LEN(A12)=0,\"\",INDEX(Str!$C$1:$C$20,MATCH(ROUND(F12,1),Str!$A$1:$A$20,1)))","v":""},"","",{"$f":"IF(LEN(A12)=0,\"\",INDEX(Uni!$C$1:$C$20,MATCH(ROUND($G12,1),Uni!$A$1:$A$20,1)))","v":""},null,"",{"$f":"IF(LEN(A12)=0,\"\",IF(OR(LEN(B12)=0,LEN(C12)=0,LEN(D12)=0,LEN(E12)=0,LEN(F12)=0,LEN(G12)=0),\"no HVI data\",IF('Base Values'!$B$6+(SUM($N12:$R12)/100)<0,0,'Base Values'!$B$6+(SUM(N12:R12)/100))))","v":""},null,{"$f":"IF(LEN(A12)=0,\"\",IF(LEN(H12)=0,INDEX(Ext!$A$1:$G$5,MATCH(0,Ext!$A$1:$A$5,0),MATCH(H$7,Ext!$A$2:$E$2,0)),IF(AND(H12>=0,H12<3),INDEX(Ext!$A$1:$G$5,MATCH(H12,Ext!$A$1:$A$5,0),MATCH(H$7,Ext!$A$2:$E$2,0)),\"invalid entry\")))","v":""},{"$f":"IF(LEN(B12)=0,\"\",IF(LEN(I12)=0,INDEX(Ext!$A$1:$G$5,MATCH(0,Ext!$A$1:$A$5,0),MATCH(I$7,Ext!$A$2:$E$2,0)),IF(AND(I12>=0,I12<3),INDEX(Ext!$A$1:$G$5,MATCH(I12,Ext!$A$1:$A$5,0),MATCH(I$7,Ext!$A$2:$E$2,0)),\"invalid entry\")))","v":""},{"$f":"IF(LEN(C12)=0,\"\",IF(LEN(J12)=0,INDEX(Ext!$A$1:$G$5,MATCH(0,Ext!$A$1:$A$5,0),MATCH(J$7,Ext!$A$2:$E$2,0)),IF(AND(J12>=0,J12<3),INDEX(Ext!$A$1:$G$5,MATCH(J12,Ext!$A$1:$A$5,0),MATCH(J$7,Ext!$A$2:$E$2,0)),\"invalid entry\")))","v":""}]
[null,null,null,null,null,null,null,null,null,null,null,{"$f":"IF(LEN(A13)=0,\"\",IF(LEN(E13)=0,\"HVI data needed\",INDEX('Staple Lookup'!$C$3:$C$100,MATCH(TRUE,'Staple Lookup'!$B$3:$B$100>=ROUND(E13,2),0))))","v":""},null,{"$f":"IF(OR(LEN(B13)=0,LEN(C13)=0,LEN(D13)=0),\"\",IF(AND(RIGHT(B13,1)*1=1,C13=8),-2000,IF(L13>=38,AB13,IF(L13<=31,AC13,AE13))))","v":""},{"$f":"IF(LEN(A13)=0,\"\",INDEX(Str!$C$1:$C$20,MATCH(ROUND(F13,1),Str!$A$1:$A$20,1)))","v":""},"","",{"$f":"IF(LEN(A13)=0,\"\",INDEX(Uni!$C$1:$C$20,MATCH(ROUND($G13,1),Uni!$A$1:$A$20,1)))","v":""},null,"",{"$f":"IF(LEN(A13)=0,\"\",IF(OR(LEN(B13)=0,LEN(C13)=0,LEN(D13)=0,LEN(E13)=0,LEN(F13)=0,LEN(G13)=0),\"no HVI data\",IF('Base Values'!$B$6+(SUM($N13:$R13)/100)<0,0,'Base Values'!$B$6+(SUM(N13:R13)/100))))","v":""},null,{"$f":"IF(LEN(A13)=0,\"\",IF(LEN(H13)=0,INDEX(Ext!$A$1:$G$5,MATCH(0,Ext!$A$1:$A$5,0),MATCH(H$7,Ext!$A$2:$E$2,0)),IF(AND(H13>=0,H13<3),INDEX(Ext!$A$1:$G$5,MATCH(H13,Ext!$A$1:$A$5,0),MATCH(H$7,Ext!$A$2:$E$2,0)),\"invalid entry\")))","v":""},{"$f":"IF(LEN(B13)=0,\"\",IF(LEN(I13)=0,INDEX(Ext!$A$1:$G$5,MATCH(0,Ext!$A$1:$A$5,0),MATCH(I$7,Ext!$A$2:$E$2,0)),IF(AND(I13>=0,I13<3),INDEX(Ext!$A$1:$G$5,MATCH(I13,Ext!$A$1:$A$5,0),MATCH(I$7,Ext!$A$2:$E$2,0)),\"invalid entry\")))","v":""},{"$f":"IF(LEN(C13)=0,\"\",IF(LEN(J13)=0,INDEX(Ext!$A$1:$G$5,MATCH(0,Ext!$A$1:$A$5,0),MATCH(J$7,Ext!$A$2:$E$2,0)),IF(AND(J13>=0,J13<3),INDEX(Ext!$A$1:$G$5,MATCH(J13,Ext!$A$1:$A$5,0),MATCH(J$7,Ext!$A$2:$E$2,0)),\"invalid entry\")))","v":""}]
[null,null,null,null,null,null,null,null,null,null,null,{"$f":"IF(LEN(A14)=0,\"\",IF(LEN(E14)=0,\"HVI data needed\",INDEX('Staple Lookup'!$C$3:$C$100,MATCH(TRUE,'Staple Lookup'!$B$3:$B$100>=ROUND(E14,2),0))))","v":""},null,{"$f":"IF(OR(LEN(B14)=0,LEN(C14)=0,LEN(D14)=0),\"\",IF(AND(RIGHT(B14,1)*1=1,C14=8),-2000,IF(L14>=38,AB14,IF(L14<=31,AC14,AE14))))","v":""},{"$f":"IF(LEN(A14)=0,\"\",INDEX(Str!$C$1:$C$20,MATCH(ROUND(F14,1),Str!$A$1:$A$20,1)))","v":""},"","",{"$f":"IF(LEN(A14)=0,\"\",INDEX(Uni!$C$1:$C$20,MATCH(ROUND($G14,1),Uni!$A$1:$A$20,1)))","v":""},null,"",{"$f":"IF(LEN(A14)=0,\"\",IF(OR(LEN(B14)=0,LEN(C14)=0,LEN(D14)=0,LEN(E14)=0,LEN(F14)=0,LEN(G14)=0),\"no HVI data\",IF('Base Values'!$B$6+(SUM($N14:$R14)/100)<0,0,'Base Values'!$B$6+(SUM(N14:R14)/100))))","v":""},null,{"$f":"IF(LEN(A14)=0,\"\",IF(LEN(H14)=0,INDEX(Ext!$A$1:$G$5,MATCH(0,Ext!$A$1:$A$5,0),MATCH(H$7,Ext!$A$2:$E$2,0)),IF(AND(H14>=0,H14<3),INDEX(Ext!$A$1:$G$5,MATCH(H14,Ext!$A$1:$A$5,0),MATCH(H$7,Ext!$A$2:$E$2,0)),\"invalid entry\")))","v":""},{"$f":"IF(LEN(B14)=0,\"\",IF(LEN(I14)=0,INDEX(Ext!$A$1:$G$5,MATCH(0,Ext!$A$1:$A$5,0),MATCH(I$7,Ext!$A$2:$E$2,0)),IF(AND(I14>=0,I14<3),INDEX(Ext!$A$1:$G$5,MATCH(I14,Ext!$A$1:$A$5,0),MATCH(I$7,Ext!$A$2:$E$2,0)),\"invalid entry\")))","v":""},{"$f":"IF(LEN(C14)=0,\"\",IF(LEN(J14)=0,INDEX(Ext!$A$1:$G$5,MATCH(0,Ext!$A$1:$A$5,0),MATCH(J$7,Ext!$A$2:$E$2,0)),IF(AND(J14>=0,J14<3),INDEX(Ext!$A$1:$G$5,MATCH(J14,Ext!$A$1:$A$5,0),MATCH(J$7,Ext!$A$2:$E$2,0)),\"invalid entry\")))","v":""}]
[null,null,null,null,null,null,null,null,null,null,null,{"$f":"IF(LEN(A15)=0,\"\",IF(LEN(E15)=0,\"HVI data needed\",INDEX('Staple Lookup'!$C$3:$C$100,MATCH(TRUE,'Staple Lookup'!$B$3:$B$100>=ROUND(E15,2),0))))","v":""},null,{"$f":"IF(OR(LEN(B15)=0,LEN(C15)=0,LEN(D15)=0),\"\",IF(AND(RIGHT(B15,1)*1=1,C15=8),-2000,IF(L15>=38,AB15,IF(L15<=31,AC15,AE15))))","v":""},{"$f":"IF(LEN(A15)=0,\"\",INDEX(Str!$C$1:$C$20,MATCH(ROUND(F15,1),Str!$A$1:$A$20,1)))","v":""},"","",{"$f":"IF(LEN(A15)=0,\"\",INDEX(Uni!$C$1:$C$20,MATCH(ROUND($G15,1),Uni!$A$1:$A$20,1)))","v":""},null,"",{"$f":"IF(LEN(A15)=0,\"\",IF(OR(LEN(B15)=0,LEN(C15)=0,LEN(D15)=0,LEN(E15)=0,LEN(F15)=0,LEN(G15)=0),\"no HVI data\",IF('Base Values'!$B$6+(SUM($N15:$R15)/100)<0,0,'Base Values'!$B$6+(SUM(N15:R15)/100))))","v":""},null,{"$f":"IF(LEN(A15)=0,\"\",IF(LEN(H15)=0,INDEX(Ext!$A$1:$G$5,MATCH(0,Ext!$A$1:$A$5,0),MATCH(H$7,Ext!$A$2:$E$2,0)),IF(AND(H15>=0,H15<3),INDEX(Ext!$A$1:$G$5,MATCH(H15,Ext!$A$1:$A$5,0),MATCH(H$7,Ext!$A$2:$E$2,0)),\"invalid entry\")))","v":""},{"$f":"IF(LEN(B15)=0,\"\",IF(LEN(I15)=0,INDEX(Ext!$A$1:$G$5,MATCH(0,Ext!$A$1:$A$5,0),MATCH(I$7,Ext!$A$2:$E$2,0)),IF(AND(I15>=0,I15<3),INDEX(Ext!$A$1:$G$5,MATCH(I15,Ext!$A$1:$A$5,0),MATCH(I$7,Ext!$A$2:$E$2,0)),\"invalid entry\")))","v":""},{"$f":"IF(LEN(C15)=0,\"\",IF(LEN(J15)=0,INDEX(Ext!$A$1:$G$5,MATCH(0,Ext!$A$1:$A$5,0),MATCH(J$7,Ext!$A$2:$E$2,0)),IF(AND(J15>=0,J15<3),INDEX(Ext!$A$1:$G$5,MATCH(J15,Ext!$A$1:$A$5,0),MATCH(J$7,Ext!$A$2:$E$2,0)),\"invalid entry\")))","v":""}]
{"$rows_left_out":35}
{"sheet":"Yield & Return","index":4,"n_rows":7,"n_cols":10,"rows_kept":7,"cut":false,"hidden":false,"merged":[]}
["Yield & Return"]
["Required lint yield & turnout data to be entered on"]
["HVI & Yield Entry sheet (columns N:O)"]
[null,null,null,"Seed Yield","Lint Value","Seed Value","Gross Return","Picking/Stripping","Ginning Cost","Net Return"]
[null,null,null,"Equals Column B x","Equals Column B x","Equals Column D x","Equals Column E +","& Moduling Costs","Equals Column B x","Equals Column B -"]
[null,"Lint Yield","Turnout","Base Values B14","Loan Value","Base Values B8","Column F","=B/C * Base Values B10","Base Values B12","Columns H & I"]
["Sample Name/Code","(lbs acre)","(%)","(lbs acre)","($/acre)","($/acre)","($/acre)","($/acre)","($/acre)","($/acre)"]

{"sheet":"Mic","index":5,"n_rows":12,"n_cols":3,"rows_kept":12,"cut":false,"hidden":true,"merged":[]}
["Micronaire"]
["Lower","Upper","Points"]
[0,2.4,-1850]
[2.5,2.6,-1345]
[2.7,2.9,-920]
[3,3.2,-635]
[3.3,3.4,-470]
[3.5,3.6,0]
[3.7,4.2,10]
[4.3,4.9000000000000004,0]
[5,5.2,-250]
[5.3,20,-400]

{"sheet":"Str","index":6,"n_rows":18,"n_cols":3,"rows_kept":18,"cut":false,"hidden":true,"merged":[]}
["Strength"]
["Lower","Upper","Points"]
[0,17.899999999999999,-700]
[18,18.899999999999999,-630]
[19,19.899999999999999,-630]
[20,20.9,-620]
[21,21.9,-610]
[22,22.9,-575]
[23,23.9,-560]
[24,24.9,-545]
[25,25.9,-495]
[26,26.9,0]
[27,27.9,0]
[28,28.9,0]
[29,29.9,5]
{"$rows_left_out":4}
{"sheet":"Staple Lookup","index":7,"n_rows":21,"n_cols":3,"rows_kept":21,"cut":false,"hidden":true,"merged":[]}
[null,"Decimal"]
["Floor","Ceiling","Staple"]
[0,0.79,24]
[{"$f":"B3+0.01","v":0.8},0.85,26]
[{"$f":"B4+0.01","v":0.86},0.89,28]
[0.9,0.92,29]
[0.93,0.95,30]
[0.96,0.98,31]
[0.99,1.01,32]
[1.02,1.04,33]
[1.05,1.07,34]
[1.08,1.1000000000000001,35]
[1.1100000000000001,1.1299999999999999,36]
[1.1399999999999999,1.17,37]
[1.18,1.2,38]
{"$rows_left_out":7}
{"sheet":"G&S","index":8,"n_rows":211,"n_cols":13,"rows_kept":211,"cut":false,"hidden":true,"merged":[]}
[null,null,null,null,null,null,null,null,null,null,null,null,"Note: Data have to be manually copied over from the pdf (then transposed)"]
[null,null,null,null,null,null,null,null,null,null,null,null,"New section created to break out color grades 11 and 21"]
[null,"Color","Leaf","26-31",32,33,34,35,36,37,"38+",null,"Gaps in coverage are assigned -4000, handled by formulas."]
["White",11,1,-390,-250,-80,150,295,445,515,520]
["White",11,2,-390,-250,-80,150,295,445,515,520]
["White",11,3,-475,-275,-100,130,250,410,470,475]
["White",11,4,-505,-300,-190,65,165,300,340,340]
["White",11,5,-575,-450,-325,-135,-5,60,95,95]
["White",11,6,-710,-550,-470,-345,-290,-255,-240,-240]
["White",11,7,-785,-645,-575,-450,-390,-355,-340,-340]
["White",11,8,-2000,-2000,-2000,-2000,-2000,-2000,-2000,-2000]
["White",21,1,-390,-250,-80,150,295,445,515,520]
["White",21,2,-390,-250,-80,150,295,445,515,520]
["White",21,3,-475,-275,-100,130,250,410,470,475]
["White",21,4,-505,-300,-190,65,165,300,340,340]
{"$rows_left_out":197}
{"sheet":"Uni","index":9,"n_rows":12,"n_cols":3,"rows_kept":12,"cut":false,"hidden":true,"merged":[]}
["Length Uniformity"]
["Lower","Upper","Points"]
[0,77.900000000000006,-60]
[78,78.900000000000006,-55]
[79,79.900000000000006,-45]
[80,80.900000000000006,0]
[81,81.900000000000006,0]
[82,82.9,5]
[83,83.9,10]
[84,84.9,15]
[85,85.9,20]
[86,200,25]

{"sheet":"Ext","index":10,"n_rows":5,"n_cols":5,"rows_kept":5,"cut":false,"hidden":true,"merged":[]}
["Extraneous Matter"]
[null,"TX/NM/OK/KS","Prep","Other","Plastic"]
[0,0,0,0,0]
[1,-435,-140,-515,-4000]
[2,-570,-695,-680,-4000]